Reaction Details
TargetQuinolone resistance protein NorA
LigandBDBM50153317
Substrate/Competitorn/a
Meas. Tech.ChEMBL_1562415 (CHEMBL3778151)
IC50 6100±n/a nM
Citation Lepri, SBuonerba, FGoracci, LVelilla, IRuzziconi, RSchindler, BDSeo, SMKaatz, GWCruciani, G Indole Based Weapons to Fight Antibiotic Resistance: A Structure-Activity Relationship Study. J Med Chem59:867-91 (2016) 
 
Quinolone resistance protein NorA
Name:Quinolone resistance protein NorA
Type:PROTEIN
Mol. Mass.:42273.03
Organism:Staphylococcus aureus
Description:ChEMBL_961221
Residue:388
BDBM50153317
NameBDBM50153317
Synonyms:CHEMBL3774886
TypeSmall organic molecule
Emp. Form.C28H36N2O3
Mol. Mass.448.597
SMILESCCOC(=O)c1c(C)n(Cc2cccc(C)c2)c2ccc(OCCCN3CCCCC3)cc12