Reaction Details
TargetLysine-specific demethylase 4D
LigandBDBM50153319
Substrate/Competitorn/a
Meas. Tech.ChEMBL_1562429 (CHEMBL3778165)
IC50 100±n/a nM
Citation Westaway, SMPreston, AGBarker, MDBrown, FBrown, JACampbell, MChung, CWDiallo, HDouault, CDrewes, GEagle, RGordon, LHaslam, CHayhow, TGHumphreys, PGJoberty, GKatso, RKruidenier, LLeveridge, MLiddle, JMosley, JMuelbaier, MRandle, RRioja, IRueger, ASeal, GASheppard, RJSingh, OTaylor, JThomas, PThomson, DWilson, DMLee, KPrinjha, RK Cell Penetrant Inhibitors of the KDM4 and KDM5 Families of Histone Lysine Demethylases. 1. 3-Amino-4-pyridine Carboxylate Derivatives. J Med Chem59:1357-69 (2016) 
 
Lysine-specific demethylase 4D
Name:Lysine-specific demethylase 4D
Type:PROTEIN
Mol. Mass.:58627.79
Organism:Homo sapiens (Human)
Description:ChEMBL_102441
Residue:523
BDBM50153319
NameBDBM50153319
Synonyms:CHEMBL3775889
TypeSmall organic molecule
Emp. Form.C12H12N2O2S
Mol. Mass.248.301
SMILESCc1ccsc1CNc1cnccc1C(O)=O