Reaction Details
TargetProlyl hydroxylase EGLN3
LigandBDBM50153346
Substrate/Competitorn/a
Meas. Tech.ChEMBL_1562430 (CHEMBL3778166)
IC50<50119±n/a nM
Citation Westaway, SMPreston, AGBarker, MDBrown, FBrown, JACampbell, MChung, CWDiallo, HDouault, CDrewes, GEagle, RGordon, LHaslam, CHayhow, TGHumphreys, PGJoberty, GKatso, RKruidenier, LLeveridge, MLiddle, JMosley, JMuelbaier, MRandle, RRioja, IRueger, ASeal, GASheppard, RJSingh, OTaylor, JThomas, PThomson, DWilson, DMLee, KPrinjha, RK Cell Penetrant Inhibitors of the KDM4 and KDM5 Families of Histone Lysine Demethylases. 1. 3-Amino-4-pyridine Carboxylate Derivatives. J Med Chem59:1357-69 (2016) 
 
Prolyl hydroxylase EGLN3
Name:Prolyl hydroxylase EGLN3
Type:Protein
Mol. Mass.:27265.54
Organism:Homo sapiens (Human)
Description:Q9H6Z9
Residue:239
BDBM50153346
NameBDBM50153346
Synonyms:CHEMBL3775366
TypeSmall organic molecule
Emp. Form.C8H11N3O2
Mol. Mass.181.1918
SMILESNCCNc1cnccc1C(O)=O