Reaction Details
TargetFatty-acid amide hydrolase 1 [30-579]
LigandBDBM50153356
Substrate/Competitorn/a
Meas. Tech.ChEMBL_1562611 (CHEMBL3779260)
IC50 3.0±n/a nM
Citation Migliore, MHabrant, DSasso, OAlbani, CBertozzi, SMArmirotti, APiomelli, DScarpelli, R Potent multitarget FAAH-COX inhibitors: Design and structure-activity relationship studies. Eur J Med Chem109:216-37 (2016) 
 
Fatty-acid amide hydrolase 1 [30-579]
Name:Fatty-acid amide hydrolase 1 [30-579]
Type:Single-pass membrane protein; homodimer
Mol. Mass.:60474.00
Organism:Rattus norvegicus (rat)
Description:P97612 (aa 30-579)
Residue:550
BDBM50153356
NameBDBM50153356
Synonyms:CHEMBL3774686
TypeSmall organic molecule
Emp. Form.C22H27NO4
Mol. Mass.369.4541
SMILESCCCCCCNC(=O)Oc1cccc(c1)-c1ccc(cc1)C(C)C(O)=O