Reaction Details
TargetCorticotropin-releasing factor receptor 1
LigandBDBM50153482
Substrate/Competitorn/a
Meas. Tech.ChEMBL_1560862 (CHEMBL3778934)
Ki 0.290000±n/a nM
Citation Erchegyi, JWang, LGulyas, JSamant, MPerrin, MHLewis, KMiller, CVaughan, JDonaldson, CFischer, WLow, WYakabi, SKarasawa, HTaché, YRivier, CRivier, J Characterization of Multisubstituted Corticotropin Releasing Factor (CRF) Peptide Antagonists (Astressins). J Med Chem59:854-66 (2016) 
 
Corticotropin-releasing factor receptor 1
Name:Corticotropin-releasing factor receptor 1
Type:Enzyme
Mol. Mass.:50744.31
Organism:Homo sapiens (Human)
Description:P34998
Residue:444
BDBM50153482
NameBDBM50153482
Synonyms:CHEMBL3775357
TypeSmall organic molecule
Emp. Form.C180H304N50O49
Mol. Mass.3952.6454
SMILESCCCCC(NC(=O)C(CCC(O)=O)NC(=O)C(CC(C)C)NC(=O)C(NC(=O)C(CCC(O)=O)NC(=O)C(CCCNC(N)=N)NC(=O)C(CC(C)C)NC(=O)C(CC(C)C)NC(=O)C(Cc1cnc[nH]1)NC(=O)C(Cc1ccccc1)NC(=O)C(NC(=O)C(CC(C)C)NC(=O)C(CC(O)=O)NC(C)=O)C(C)O)C(C)C)C(=O)NC(C)C(=O)NC(CCCNC(N)=N)C(=O)NC(C)C(=O)NC(CCC(O)=O)C(=O)NC(CCC(N)=O)C(=O)NC(C)(CC(C)C)C(=O)NC(C)C(=O)NC(CCC(N)=O)C(=O)NC1CCC(=O)NCCCCC(NC(=O)C(C)(CC(C)C)NC(=O)C(C)NC1=O)C(=O)NC(CC(N)=O)C(=O)NC(CCCNC(N)=N)C(=O)NC(CCCCN)C(=O)NC(CC(C)C)C(=O)NC(CCCC)C(=O)NC(CCC(O)=O)C(=O)NC(C)(CC(C)C)C(=O)NC(C(C)CC)C(N)=O