Reaction Details
TargetCorticotropin-releasing factor receptor 2
LigandBDBM50153487
Substrate/Competitorn/a
Meas. Tech.ChEMBL_1560863 (CHEMBL3778935)
Ki 0.890000±n/a nM
Citation Erchegyi, JWang, LGulyas, JSamant, MPerrin, MHLewis, KMiller, CVaughan, JDonaldson, CFischer, WLow, WYakabi, SKarasawa, HTaché, YRivier, CRivier, J Characterization of Multisubstituted Corticotropin Releasing Factor (CRF) Peptide Antagonists (Astressins). J Med Chem59:854-66 (2016) 
 
Corticotropin-releasing factor receptor 2
Name:Corticotropin-releasing factor receptor 2
Type:PROTEIN
Mol. Mass.:47628.12
Organism:Mus musculus
Description:ChEMBL_51276
Residue:411
BDBM50153487
NameBDBM50153487
Synonyms:CHEMBL3775400
TypeSmall organic molecule
Emp. Form.C177H290N50O49
Mol. Mass.3902.5021
SMILESCCCCC(NC(=O)C(CCC(O)=O)NC(=O)C(CC(C)C)NC(=O)C(NC(=O)C(CCC(O)=O)NC(=O)C(CCCNC(N)=N)NC(=O)C(CC(C)C)NC(=O)C(CC(C)C)NC(=O)C(Cc1cnc[nH]1)NC(=O)C(Cc1ccccc1)NC(=O)C(NC(=O)C(CC(C)C)NC(=O)C(CC(O)=O)NC(C)=O)C(C)O)C(C)C)C(=O)NC(C)C(=O)NC(CCCNC(N)=N)C(=O)NC(C)C(=O)NC(CCC(O)=O)C(=O)NC(CCC(N)=O)C(=O)NC(C)(C)C(=O)NC(C)C(=O)NC(CCC(N)=O)C(=O)NC1CCC(=O)NCCCCC(NC(=O)C(C)(C)NC(=O)C(C)NC1=O)C(=O)NC(CC(N)=O)C(=O)NC(CCCNC(N)=N)C(=O)NC(CCCCN)C(=O)NC(CC(C)C)C(=O)NC(CCCC)C(=O)NC(CCC(O)=O)C(=O)NC(C)(Cc1ccccc1)C(=O)NC(C(C)CC)C(N)=O