Reaction Details
TargetEstrogen receptor
LigandBDBM50153661
Substrate/Competitorn/a
Meas. Tech.ChEMBL_1561513 (CHEMBL3776150)
IC50 0.690000±n/a nM
Citation Scott, JSBailey, ADavies, RDDegorce, SLMacFaul, PAGingell, HMoss, TNorman, RAPink, JHRabow, AARoberts, BSmith, PD Tetrahydroisoquinoline Phenols: Selective Estrogen Receptor Downregulator Antagonists with Oral Bioavailability in Rat. ACS Med Chem Lett7:94-9 (2016) 
 
Estrogen receptor
Name:Estrogen receptor
Type:Protein
Mol. Mass.:66230.44
Organism:Homo sapiens (Human)
Description:P03372
Residue:595
BDBM50153661
NameBDBM50153661
Synonyms:CHEMBL3774510
TypeSmall organic molecule
Emp. Form.C24H26F3NO3
Mol. Mass.433.4633
SMILESC[C@H](CF)CN1[C@@H](c2ccc(O)cc2CC1(C)C)c1c(F)cc(\C=C\C(O)=O)cc1F