Reaction Details
TargetEstrogen receptor
LigandBDBM50153692
Substrate/Competitorn/a
Meas. Tech.ChEMBL_1561513 (CHEMBL3776150)
IC50 1.8±n/a nM
Citation Scott, JSBailey, ADavies, RDDegorce, SLMacFaul, PAGingell, HMoss, TNorman, RAPink, JHRabow, AARoberts, BSmith, PD Tetrahydroisoquinoline Phenols: Selective Estrogen Receptor Downregulator Antagonists with Oral Bioavailability in Rat. ACS Med Chem Lett7:94-9 (2016) 
 
Estrogen receptor
Name:Estrogen receptor
Type:Protein
Mol. Mass.:66230.44
Organism:Homo sapiens (Human)
Description:P03372
Residue:595
BDBM50153692
NameBDBM50153692
Synonyms:CHEMBL3775766
TypeSmall organic molecule
Emp. Form.C24H27F2NO3
Mol. Mass.415.4729
SMILESCC(C)CN1[C@@H](c2ccc(O)cc2CC1(C)C)c1c(F)cc(\C=C\C(O)=O)cc1F