Reaction Details
TargetEstrogen receptor
LigandBDBM50153716
Substrate/Competitorn/a
Meas. Tech.ChEMBL_1561513 (CHEMBL3776150)
IC50 4.7±n/a nM
Citation Scott, JSBailey, ADavies, RDDegorce, SLMacFaul, PAGingell, HMoss, TNorman, RAPink, JHRabow, AARoberts, BSmith, PD Tetrahydroisoquinoline Phenols: Selective Estrogen Receptor Downregulator Antagonists with Oral Bioavailability in Rat. ACS Med Chem Lett7:94-9 (2016) 
 
Estrogen receptor
Name:Estrogen receptor
Type:Protein
Mol. Mass.:66230.44
Organism:Homo sapiens (Human)
Description:P03372
Residue:595
BDBM50153716
NameBDBM50153716
Synonyms:CHEMBL3775344
TypeSmall organic molecule
Emp. Form.C24H21NO3
Mol. Mass.371.4284
SMILESOC(=O)\C=C\c1ccc(cc1)C1N(CCc2cc(O)ccc12)c1ccccc1