Reaction Details
TargetSomatostatin receptor type 4
LigandBDBM50155308
Substrate/Competitorn/a
Meas. Tech.ChEMBL_1565560 (CHEMBL3782229)
Ki 1170±n/a nM
Citation Fridén-Saxin, MSeifert, TMalo, Mda Silva Andersson, KPemberton, NDyrager, CFriberg, ADahlén, KWallén, EAGrøtli, MLuthman, K Chroman-4-one and chromone based somatostatinß-turn mimetics. Eur J Med Chem114:59-64 (2016) 
 
Somatostatin receptor type 4
Name:Somatostatin receptor type 4
Type:Enzyme
Mol. Mass.:42015.38
Organism:Homo sapiens (Human)
Description:P31391
Residue:388
BDBM50155308
NameBDBM50155308
Synonyms:CHEMBL3780791
TypeSmall organic molecule
Emp. Form.C24H24Cl3NO2
Mol. Mass.464.812
SMILESCl.Cl.NCCCc1cc(Cl)cc2c1oc(CCc1cccc3ccccc13)cc2=O