Reaction Details
TargetSomatostatin receptor type 2
LigandBDBM50155309
Substrate/Competitorn/a
Meas. Tech.ChEMBL_1565559 (CHEMBL3782228)
Ki 6850±n/a nM
Citation Fridén-Saxin, MSeifert, TMalo, Mda Silva Andersson, KPemberton, NDyrager, CFriberg, ADahlén, KWallén, EAGrøtli, MLuthman, K Chroman-4-one and chromone based somatostatinß-turn mimetics. Eur J Med Chem114:59-64 (2016) 
 
Somatostatin receptor type 2
Name:Somatostatin receptor type 2
Type:Enzyme
Mol. Mass.:41344.94
Organism:Homo sapiens (Human)
Description:P30874
Residue:369
BDBM50155309
NameBDBM50155309
Synonyms:CHEMBL3780496
TypeSmall organic molecule
Emp. Form.C24H24ClNO2
Mol. Mass.393.906
SMILESNCCCc1cc(Cl)cc2C(=O)CC(CCc3cccc4ccccc34)Oc12