Reaction Details
TargetPannexin-1
LigandBDBM50206509
Substrate/Competitorn/a
Meas. Tech.ChEMBL_1564791 (CHEMBL3784394)
IC50 150000±n/a nM
Citation Baldwin, AGBrough, DFreeman, S Inhibiting the Inflammasome: A Chemical Perspective. J Med Chem59:1691-710 (2016) 
 
Pannexin-1
Name:Pannexin-1
Type:PROTEIN
Mol. Mass.:48047.55
Organism:Homo sapiens (Human)
Description:ChEMBL_116759
Residue:426
BDBM50206509
NameBDBM50206509
Synonyms:4-Dipropylsulfamoyl-benzoic acid 4-Dipropylsulfamoyl-benzoic acid(probenecid) CHEMBL897 Probalan
TypeSmall organic molecule
Emp. Form.C13H19NO4S
Mol. Mass.285.359
SMILESCCCN(CCC)S(=O)(=O)c1ccc(cc1)C(O)=O