Reaction Details
TargetMu-type opioid receptor
LigandBDBM50010483
Substrate/Competitorn/a
Meas. Tech.ChEMBL_1564947 (CHEMBL3783008)
Ki 0.580000±n/a nM
Citation Betti, CStarnowska, JMika, JDyniewicz, JFrankiewicz, LNovoa, ABochynska, MKeresztes, AKosson, PMakuch, WVan Duppen, JChung, NNVanden Broeck, JLipkowski, AWSchiller, PWJanssens, FCeusters, MSommen, FMeert, TPrzewlocka, BTourwé, DBallet, S Dual Alleviation of Acute and Neuropathic Pain by Fused Opioid Agonist-Neurokinin 1 Antagonist Peptidomimetics. ACS Med Chem Lett6:1209-14 (2015) 
 
Mu-type opioid receptor
Name:Mu-type opioid receptor
Type:G Protein-Coupled Receptor (GPCR)
Mol. Mass.:44503.11
Organism:Rattus norvegicus (rat)
Description:Competition binding assays were carried out using membrane preparations from transfected HN9.10 cells that constitutively expressed the mu opioid receptor.
Residue:398
BDBM50010483
NameBDBM50010483
Synonyms:CHEMBL2181202
TypeSmall organic molecule
Emp. Form.C32H49N9O5
Mol. Mass.639.7888
SMILESCc1cc(O)cc(C)c1C[C@H](N)C(=O)N[C@H](CCCNC(N)=N)C(=O)N[C@@H](Cc1ccccc1)C(=O)N[C@@H](CCCCN)C(N)=O