Reaction Details
TargetMitogen-activated protein kinase 12
LigandBDBM50156125
Substrate/Competitorn/a
Meas. Tech.ChEMBL_1563502 (CHEMBL3783187)
IC50 1504±n/a nM
Citation Onions, STIto, KCharron, CEBrown, RJColucci, MFrickel, FHardy, GJoly, KKing-Underwood, JKizawa, YKnowles, IMurray, PJNovak, ARani, ARapeport, GSmith, AStrong, PTaddei, DMWilliams, JG Discovery of Narrow Spectrum Kinase Inhibitors: New Therapeutic Agents for the Treatment of COPD and Steroid-Resistant Asthma. J Med Chem59:1727-46 (2016) 
 
Mitogen-activated protein kinase 12
Name:Mitogen-activated protein kinase 12
Type:Protein
Mol. Mass.:41938.69
Organism:Homo sapiens (Human)
Description:P53778
Residue:367
BDBM50156125
NameBDBM50156125
Synonyms:CHEMBL3781587
TypeSmall organic molecule
Emp. Form.C32H34N6O2
Mol. Mass.534.6514
SMILESCc1ccc(cc1)-n1nc(cc1NC(=O)Nc1ccc(OCCc2ccnc(N)c2)c2ccccc12)C(C)(C)C