Reaction Details
TargetMitogen-activated protein kinase 12
LigandBDBM50156162
Substrate/Competitorn/a
Meas. Tech.ChEMBL_1563502 (CHEMBL3783187)
IC50 148±n/a nM
Citation Onions, STIto, KCharron, CEBrown, RJColucci, MFrickel, FHardy, GJoly, KKing-Underwood, JKizawa, YKnowles, IMurray, PJNovak, ARani, ARapeport, GSmith, AStrong, PTaddei, DMWilliams, JG Discovery of Narrow Spectrum Kinase Inhibitors: New Therapeutic Agents for the Treatment of COPD and Steroid-Resistant Asthma. J Med Chem59:1727-46 (2016) 
 
Mitogen-activated protein kinase 12
Name:Mitogen-activated protein kinase 12
Type:Protein
Mol. Mass.:41938.69
Organism:Homo sapiens (Human)
Description:P53778
Residue:367
BDBM50156162
NameBDBM50156162
Synonyms:CHEMBL3781245
TypeSmall organic molecule
Emp. Form.C34H36N6O3S
Mol. Mass.608.753
SMILESCSCC(=O)Nc1cc(COc2ccc(NC(=O)Nc3cc(nn3-c3ccc(C)cc3)C(C)(C)C)c3ccccc23)ccn1