Reaction Details
TargetMitogen-activated protein kinase 12
LigandBDBM50156163
Substrate/Competitorn/a
Meas. Tech.ChEMBL_1563502 (CHEMBL3783187)
IC50 55±n/a nM
Citation Onions, STIto, KCharron, CEBrown, RJColucci, MFrickel, FHardy, GJoly, KKing-Underwood, JKizawa, YKnowles, IMurray, PJNovak, ARani, ARapeport, GSmith, AStrong, PTaddei, DMWilliams, JG Discovery of Narrow Spectrum Kinase Inhibitors: New Therapeutic Agents for the Treatment of COPD and Steroid-Resistant Asthma. J Med Chem59:1727-46 (2016) 
 
Mitogen-activated protein kinase 12
Name:Mitogen-activated protein kinase 12
Type:Protein
Mol. Mass.:41938.69
Organism:Homo sapiens (Human)
Description:P53778
Residue:367
BDBM50156163
NameBDBM50156163
Synonyms:CHEMBL3780832
TypeSmall organic molecule
Emp. Form.C34H36N6O5S
Mol. Mass.640.752
SMILESCc1ccc(cc1)-n1nc(cc1NC(=O)Nc1ccc(OCc2ccnc(NC(=O)CS(C)(=O)=O)c2)c2ccccc12)C(C)(C)C