Reaction Details
TargetTyrosine-protein kinase HCK
LigandBDBM50156158
Substrate/Competitorn/a
Meas. Tech.ChEMBL_1563501 (CHEMBL3783186)
IC50 197±n/a nM
Citation Onions, STIto, KCharron, CEBrown, RJColucci, MFrickel, FHardy, GJoly, KKing-Underwood, JKizawa, YKnowles, IMurray, PJNovak, ARani, ARapeport, GSmith, AStrong, PTaddei, DMWilliams, JG Discovery of Narrow Spectrum Kinase Inhibitors: New Therapeutic Agents for the Treatment of COPD and Steroid-Resistant Asthma. J Med Chem59:1727-46 (2016) 
 
Tyrosine-protein kinase HCK
Name:Tyrosine-protein kinase HCK
Type:Enzyme Catalytic Domain
Mol. Mass.:59600.18
Organism:Homo sapiens (Human)
Description:P08631
Residue:526
BDBM50156158
NameBDBM50156158
Synonyms:CHEMBL3781244
TypeSmall organic molecule
Emp. Form.C35H39N7O3
Mol. Mass.605.7293
SMILESCN(C)CC(=O)Nc1cc(COc2ccc(NC(=O)Nc3cc(nn3-c3ccc(C)cc3)C(C)(C)C)c3ccccc23)ccn1