Reaction Details
TargetTyrosine-protein kinase HCK
LigandBDBM50156160
Substrate/Competitorn/a
Meas. Tech.ChEMBL_1563501 (CHEMBL3783186)
IC50 187±n/a nM
Citation Onions, STIto, KCharron, CEBrown, RJColucci, MFrickel, FHardy, GJoly, KKing-Underwood, JKizawa, YKnowles, IMurray, PJNovak, ARani, ARapeport, GSmith, AStrong, PTaddei, DMWilliams, JG Discovery of Narrow Spectrum Kinase Inhibitors: New Therapeutic Agents for the Treatment of COPD and Steroid-Resistant Asthma. J Med Chem59:1727-46 (2016) 
 
Tyrosine-protein kinase HCK
Name:Tyrosine-protein kinase HCK
Type:Enzyme Catalytic Domain
Mol. Mass.:59600.18
Organism:Homo sapiens (Human)
Description:P08631
Residue:526
BDBM50156160
NameBDBM50156160
Synonyms:CHEMBL3780667
TypeSmall organic molecule
Emp. Form.C37H41N7O4
Mol. Mass.647.7659
SMILESCc1ccc(cc1)-n1nc(cc1NC(=O)Nc1ccc(OCc2ccnc(NC(=O)CN3CCOCC3)c2)c2ccccc12)C(C)(C)C