Reaction Details
TargetMitogen-activated protein kinase 14
LigandBDBM14862
Substrate/Competitorn/a
Meas. Tech.ChEMBL_1563504 (CHEMBL3783189)
IC50 22±n/a nM
Citation Onions, STIto, KCharron, CEBrown, RJColucci, MFrickel, FHardy, GJoly, KKing-Underwood, JKizawa, YKnowles, IMurray, PJNovak, ARani, ARapeport, GSmith, AStrong, PTaddei, DMWilliams, JG Discovery of Narrow Spectrum Kinase Inhibitors: New Therapeutic Agents for the Treatment of COPD and Steroid-Resistant Asthma. J Med Chem59:1727-46 (2016) 
 
Mitogen-activated protein kinase 14
Name:Mitogen-activated protein kinase 14
Type:Serine/threonine-protein kinase
Mol. Mass.:41286.76
Organism:Homo sapiens (Human)
Description:Q16539
Residue:360
BDBM14862
NameBDBM14862
Synonyms:1-(5-tert-butyl-2-p-tolyl-2H-pyrazol-3-yl)-3-[4-(2-imidazol-1-yl-ethoxy)-naphthalen-1-yl]-urea BIRB-796 Analog 50
TypeSmall organic molecule
Emp. Form.C30H32N6O2
Mol. Mass.508.6141
SMILESCc1ccc(cc1)-n1nc(cc1NC(=O)Nc1ccc(OCCn2ccnc2)c2ccccc12)C(C)(C)C