Reaction Details
TargetMitogen-activated protein kinase 14
LigandBDBM50156125
Substrate/Competitorn/a
Meas. Tech.ChEMBL_1563504 (CHEMBL3783189)
IC50 60±n/a nM
Citation Onions, STIto, KCharron, CEBrown, RJColucci, MFrickel, FHardy, GJoly, KKing-Underwood, JKizawa, YKnowles, IMurray, PJNovak, ARani, ARapeport, GSmith, AStrong, PTaddei, DMWilliams, JG Discovery of Narrow Spectrum Kinase Inhibitors: New Therapeutic Agents for the Treatment of COPD and Steroid-Resistant Asthma. J Med Chem59:1727-46 (2016) 
 
Mitogen-activated protein kinase 14
Name:Mitogen-activated protein kinase 14
Type:Serine/threonine-protein kinase
Mol. Mass.:41286.76
Organism:Homo sapiens (Human)
Description:Q16539
Residue:360
BDBM50156125
NameBDBM50156125
Synonyms:CHEMBL3781587
TypeSmall organic molecule
Emp. Form.C32H34N6O2
Mol. Mass.534.6514
SMILESCc1ccc(cc1)-n1nc(cc1NC(=O)Nc1ccc(OCCc2ccnc(N)c2)c2ccccc12)C(C)(C)C