Reaction Details
TargetChromobox protein homolog 7
LigandBDBM50155893
Substrate/Competitorn/a
Meas. Tech.ChEMBL_1565742 (CHEMBL3782540)
Kd 400±n/a nM
Citation Milosevich, NGignac, MCMcFarlane, JSimhadri, CHorvath, SDaze, KDCroft, CSDheri, AQuon, TTDouglas, SFWulff, JEPaci, IHof, F Selective Inhibition of CBX6: A Methyllysine Reader Protein in the Polycomb Family. ACS Med Chem Lett7:139-44 (2016) 
 
Chromobox protein homolog 7
Name:Chromobox protein homolog 7
Type:Protein
Mol. Mass.:28351.76
Organism:Homo sapiens (Human)
Description:n/a
Residue:251
BDBM50155893
NameBDBM50155893
Synonyms:CHEMBL3780712
TypeSmall organic molecule
Emp. Form.C73H85BrN11O17S
Mol. Mass.1500.488
SMILESCC[C@H](NC(=O)[C@H](Cc1ccccc1)NC(=O)c1ccc(Br)cc1)C(=O)N[C@@H](Cc1ccc(O)cc1)C(=O)N[C@@H](CCCC[N+](C)(C)C)C(=O)N[C@@H](CO)C(=O)N[C@@H](CCC(O)=O)C(=O)N[C@@H](CCCCNC(=S)Nc1ccc(c(c1)C(O)=O)-c1c2ccc(O)cc2oc2cc(=O)ccc12)C(N)=O