Reaction Details
TargetCytochrome P450 26B1
LigandBDBM50033077
Substrate/Competitorn/a
Meas. Tech.ChEMBL_1567868 (CHEMBL3789263)
IC50 12600±n/a nM
Citation Diaz, PHuang, WKeyari, CMButtrick, BPrice, LGuilloteau, NTripathy, SSperandio, VGFronczek, FRAstruc-Diaz, FIsoherranen, N Development and Characterization of Novel and Selective Inhibitors of Cytochrome P450 CYP26A1, the Human Liver Retinoic Acid Hydroxylase. J Med Chem59:2579-95 (2016) 
 
Cytochrome P450 26B1
Name:Cytochrome P450 26B1
Type:PROTEIN
Mol. Mass.:57525.03
Organism:Homo sapiens (Human)
Description:ChEMBL_115648
Residue:512
BDBM50033077
NameBDBM50033077
Synonyms:4-[2-(5,5,8,8-Tetramethyl-5,6,7,8-tetrahydro-naphthalen-2-yl)-[1,3]dioxolan-2-yl]-benzoic acid | CHEMBL112715
TypeSmall organic molecule
Emp. Form.C24H28O4
Mol. Mass.380.4767
SMILESCC1(C)CCC(C)(C)c2cc(ccc12)C1(OCCO1)c1ccc(cc1)C(O)=O