Reaction Details
TargetCytochrome P450 26A1
LigandBDBM50157726
Substrate/Competitorn/a
Meas. Tech.ChEMBL_1567869 (CHEMBL3789264)
IC50 10600±n/a nM
Citation Diaz, PHuang, WKeyari, CMButtrick, BPrice, LGuilloteau, NTripathy, SSperandio, VGFronczek, FRAstruc-Diaz, FIsoherranen, N Development and Characterization of Novel and Selective Inhibitors of Cytochrome P450 CYP26A1, the Human Liver Retinoic Acid Hydroxylase. J Med Chem59:2579-95 (2016) 
 
Cytochrome P450 26A1
Name:Cytochrome P450 26A1
Type:Enzyme
Mol. Mass.:56216.16
Organism:Homo sapiens (Human)
Description:O43174
Residue:497
BDBM50157726
NameBDBM50157726
Synonyms:CHEMBL3786043
TypeSmall organic molecule
Emp. Form.C22H26O2S
Mol. Mass.354.506
SMILESCC1(C)CCC(C)(C)c2cc(Sc3ccc(CC(O)=O)cc3)ccc12