Reaction Details
TargetCytochrome P450 26B1
LigandBDBM50033067
Substrate/Competitorn/a
Meas. Tech.ChEMBL_1567868 (CHEMBL3789263)
IC50 1100±n/a nM
Citation Diaz, PHuang, WKeyari, CMButtrick, BPrice, LGuilloteau, NTripathy, SSperandio, VGFronczek, FRAstruc-Diaz, FIsoherranen, N Development and Characterization of Novel and Selective Inhibitors of Cytochrome P450 CYP26A1, the Human Liver Retinoic Acid Hydroxylase. J Med Chem59:2579-95 (2016) 
 
Cytochrome P450 26B1
Name:Cytochrome P450 26B1
Type:PROTEIN
Mol. Mass.:57525.03
Organism:Homo sapiens (Human)
Description:ChEMBL_115648
Residue:512
BDBM50033067
NameBDBM50033067
Synonyms:4-[2-(5,5,8,8-Tetramethyl-5,6,7,8-tetrahydro-naphthalen-2-yl)-[1,3]dithiolan-2-yl]-benzoic acid | CHEMBL323626
TypeSmall organic molecule
Emp. Form.C24H28O2S2
Mol. Mass.412.608
SMILESCC1(C)CCC(C)(C)c2cc(ccc12)C1(SCCS1)c1ccc(cc1)C(O)=O