Reaction Details
TargetCytochrome P450 3A4
LigandBDBM50157717
Substrate/Competitorn/a
Meas. Tech.ChEMBL_1567870 (CHEMBL3789265)
IC50 30000±n/a nM
Citation Diaz, PHuang, WKeyari, CMButtrick, BPrice, LGuilloteau, NTripathy, SSperandio, VGFronczek, FRAstruc-Diaz, FIsoherranen, N Development and Characterization of Novel and Selective Inhibitors of Cytochrome P450 CYP26A1, the Human Liver Retinoic Acid Hydroxylase. J Med Chem59:2579-95 (2016) 
 
Cytochrome P450 3A4
Name:Cytochrome P450 3A4
Type:Enzyme
Mol. Mass.:57349.57
Organism:Homo sapiens (Human)
Description:n/a
Residue:503
BDBM50157717
NameBDBM50157717
Synonyms:CHEMBL3786581
TypeSmall organic molecule
Emp. Form.C26H30O4
Mol. Mass.406.514
SMILESCC1(C)CCC(C)(C)c2cc(ccc12)C1(OCCO1)c1ccc(\C=C\C(O)=O)cc1