Reaction Details
TargetCytochrome P450 26A1
LigandBDBM50157729
Substrate/Competitorn/a
Meas. Tech.ChEMBL_1567869 (CHEMBL3789264)
IC50 3500±n/a nM
Citation Diaz, PHuang, WKeyari, CMButtrick, BPrice, LGuilloteau, NTripathy, SSperandio, VGFronczek, FRAstruc-Diaz, FIsoherranen, N Development and Characterization of Novel and Selective Inhibitors of Cytochrome P450 CYP26A1, the Human Liver Retinoic Acid Hydroxylase. J Med Chem59:2579-95 (2016) 
 
Cytochrome P450 26A1
Name:Cytochrome P450 26A1
Type:Enzyme
Mol. Mass.:56216.16
Organism:Homo sapiens (Human)
Description:O43174
Residue:497
BDBM50157729
NameBDBM50157729
Synonyms:CHEMBL3787691
TypeSmall organic molecule
Emp. Form.C23H27NO4
Mol. Mass.381.4648
SMILESCC1(C)CCC(C)(C)c2cc(ccc12)C(\COc1ccc(cc1)C(O)=O)=N\O