Reaction Details
TargetSerine/threonine-protein kinase pim-2
LigandBDBM50160995
Substrate/Competitorn/a
Meas. Tech.ChEBML_1570461
Ki<3±n/a nM
Citation Nishiguchi, GABurger, MTHan, WLan, JAtallah, GTamez, VLindvall, MBellamacina, CGarcia, PFeucht, PZavorotinskaya, TDai, YWong, K Design, synthesis and structure activity relationship of potent pan-PIM kinase inhibitors derived from the pyridyl carboxamide scaffold. Bioorg Med Chem Lett26:2328-32 (2016) 
 
Serine/threonine-protein kinase pim-2
Name:Serine/threonine-protein kinase pim-2
Type:Serine/threonine-protein kinase
Mol. Mass.:34185.93
Organism:Homo sapiens (Human)
Description:Q9P1W9
Residue:311
BDBM50160995
NameBDBM50160995
Synonyms:CHEMBL3793938
TypeSmall organic molecule
Emp. Form.C22H17F2N7O
Mol. Mass.433.4135
SMILESCc1nc(N)cc(n1)-c1ccncc1NC(=O)c1nc(ccc1N)-c1c(F)cccc1F