Reaction Details
TargetSerine/threonine-protein kinase pim-3
LigandBDBM50162818
Substrate/Competitorn/a
Meas. Tech.ChEMBL_1570462 (CHEMBL3794689)
Ki<3±n/a nM
Citation Nishiguchi, GABurger, MTHan, WLan, JAtallah, GTamez, VLindvall, MBellamacina, CGarcia, PFeucht, PZavorotinskaya, TDai, YWong, K Design, synthesis and structure activity relationship of potent pan-PIM kinase inhibitors derived from the pyridyl carboxamide scaffold. Bioorg Med Chem Lett26:2328-32 (2016) 
 
Serine/threonine-protein kinase pim-3
Name:Serine/threonine-protein kinase pim-3
Type:Protein
Mol. Mass.:35888.19
Organism:Homo sapiens (Human)
Description:Q86V86
Residue:326
BDBM50162818
NameBDBM50162818
Synonyms:CHEMBL3793067
TypeSmall organic molecule
Emp. Form.C23H18F2N6O
Mol. Mass.432.4254
SMILESCc1cc(cc(N)n1)-c1ccncc1NC(=O)c1nc(ccc1N)-c1c(F)cccc1F