Reaction Details
TargetHepatocyte growth factor activator
LigandBDBM50158161
Substrate/Competitorn/a
Meas. Tech.ChEBML_1565754
Ki 1100±n/a nM
Citation Venukadasula, PKOwusu, BYBansal, NRoss, LJHobrath, JVBao, DTruss, JWStackhouse, MMessick, TEKlampfer, LGalemmo, RA Design and Synthesis of Nonpeptide Inhibitors of Hepatocyte Growth Factor Activation. ACS Med Chem Lett7:177-81 (2016) 
 
Hepatocyte growth factor activator
Name:Hepatocyte growth factor activator
Type:PROTEIN
Mol. Mass.:70690.18
Organism:Homo sapiens (Human)
Description:ChEMBL_109514
Residue:655
BDBM50158161
NameBDBM50158161
Synonyms:CHEMBL3781405
TypeSmall organic molecule
Emp. Form.C32H38N6O2
Mol. Mass.538.6831
SMILESNC(=N)c1cccc(c1)N1CC(CNC(=O)c2ccccc2)CN(CC2CCN(Cc3ccccc3)CC2)C1=O