Reaction Details
TargetHepatocyte growth factor activator
LigandBDBM50158155
Substrate/Competitorn/a
Meas. Tech.ChEMBL_1565754 (CHEMBL3782552)
Ki 230±n/a nM
Citation Venukadasula, PKOwusu, BYBansal, NRoss, LJHobrath, JVBao, DTruss, JWStackhouse, MMessick, TEKlampfer, LGalemmo, RA Design and Synthesis of Nonpeptide Inhibitors of Hepatocyte Growth Factor Activation. ACS Med Chem Lett7:177-81 (2016) 
 
Hepatocyte growth factor activator
Name:Hepatocyte growth factor activator
Type:PROTEIN
Mol. Mass.:70690.18
Organism:Homo sapiens (Human)
Description:ChEMBL_109514
Residue:655
BDBM50158155
NameBDBM50158155
Synonyms:CHEMBL3781354
TypeSmall organic molecule
Emp. Form.C25H33N5O2
Mol. Mass.435.5618
SMILESNC(=N)c1cccc(c1)N1CC(CO)CN(CC2CCN(Cc3ccccc3)CC2)C1=O