Reaction Details
TargetHepatocyte growth factor activator
LigandBDBM50158154
Substrate/Competitorn/a
Meas. Tech.ChEMBL_1565754 (CHEMBL3782552)
Ki 880±n/a nM
Citation Venukadasula, PKOwusu, BYBansal, NRoss, LJHobrath, JVBao, DTruss, JWStackhouse, MMessick, TEKlampfer, LGalemmo, RA Design and Synthesis of Nonpeptide Inhibitors of Hepatocyte Growth Factor Activation. ACS Med Chem Lett7:177-81 (2016) 
 
Hepatocyte growth factor activator
Name:Hepatocyte growth factor activator
Type:PROTEIN
Mol. Mass.:70690.18
Organism:Homo sapiens (Human)
Description:ChEMBL_109514
Residue:655
BDBM50158154
NameBDBM50158154
Synonyms:CHEMBL3781784
TypeSmall organic molecule
Emp. Form.C24H31N5O2
Mol. Mass.421.5352
SMILESNC(=N)c1cccc(c1)N1CC(O)CN(CC2CCN(Cc3ccccc3)CC2)C1=O