Reaction Details
TargetSerine protease hepsin
LigandBDBM50158152
Substrate/Competitorn/a
Meas. Tech.ChEMBL_1565753 (CHEMBL3782551)
Ki 310±n/a nM
Citation Venukadasula, PKOwusu, BYBansal, NRoss, LJHobrath, JVBao, DTruss, JWStackhouse, MMessick, TEKlampfer, LGalemmo, RA Design and Synthesis of Nonpeptide Inhibitors of Hepatocyte Growth Factor Activation. ACS Med Chem Lett7:177-81 (2016) 
 
Serine protease hepsin
Name:Serine protease hepsin
Type:Enzyme
Mol. Mass.:45016.98
Organism:Homo sapiens (Human)
Description:Human deglycosylated hepsin was expressed in Pichia pastoris.
Residue:417
BDBM50158152
NameBDBM50158152
Synonyms:CHEMBL3780269
TypeSmall organic molecule
Emp. Form.C33H40N6O2
Mol. Mass.552.7097
SMILESNC(=N)c1cccc(c1)N1CC(CNC(=O)Cc2ccccc2)CN(CC2CCN(Cc3ccccc3)CC2)C1=O