Reaction Details
TargetCoagulation factor X
LigandBDBM50158152
Substrate/Competitorn/a
Meas. Tech.ChEMBL_1565757 (CHEMBL3782597)
Ki 1550±n/a nM
Citation Venukadasula, PKOwusu, BYBansal, NRoss, LJHobrath, JVBao, DTruss, JWStackhouse, MMessick, TEKlampfer, LGalemmo, RA Design and Synthesis of Nonpeptide Inhibitors of Hepatocyte Growth Factor Activation. ACS Med Chem Lett7:177-81 (2016) 
 
Coagulation factor X
Name:Coagulation factor X
Type:Enzyme
Mol. Mass.:54726.60
Organism:Homo sapiens (Human)
Description:n/a
Residue:488
BDBM50158152
NameBDBM50158152
Synonyms:CHEMBL3780269
TypeSmall organic molecule
Emp. Form.C33H40N6O2
Mol. Mass.552.7097
SMILESNC(=N)c1cccc(c1)N1CC(CNC(=O)Cc2ccccc2)CN(CC2CCN(Cc3ccccc3)CC2)C1=O