Reaction Details
TargetSerine protease hepsin
LigandBDBM50158155
Substrate/Competitorn/a
Meas. Tech.ChEMBL_1565753 (CHEMBL3782551)
Ki 690±n/a nM
Citation Venukadasula, PKOwusu, BYBansal, NRoss, LJHobrath, JVBao, DTruss, JWStackhouse, MMessick, TEKlampfer, LGalemmo, RA Design and Synthesis of Nonpeptide Inhibitors of Hepatocyte Growth Factor Activation. ACS Med Chem Lett7:177-81 (2016) 
 
Serine protease hepsin
Name:Serine protease hepsin
Type:Enzyme
Mol. Mass.:45016.98
Organism:Homo sapiens (Human)
Description:Human deglycosylated hepsin was expressed in Pichia pastoris.
Residue:417
BDBM50158155
NameBDBM50158155
Synonyms:CHEMBL3781354
TypeSmall organic molecule
Emp. Form.C25H33N5O2
Mol. Mass.435.5618
SMILESNC(=N)c1cccc(c1)N1CC(CO)CN(CC2CCN(Cc3ccccc3)CC2)C1=O