Reaction Details
TargetProthrombin
LigandBDBM50158158
Substrate/Competitorn/a
Meas. Tech.ChEMBL_1565756 (CHEMBL3782596)
Ki 29700±n/a nM
Citation Venukadasula, PKOwusu, BYBansal, NRoss, LJHobrath, JVBao, DTruss, JWStackhouse, MMessick, TEKlampfer, LGalemmo, RA Design and Synthesis of Nonpeptide Inhibitors of Hepatocyte Growth Factor Activation. ACS Med Chem Lett7:177-81 (2016) 
 
Prothrombin
Name:Prothrombin
Type:Protein
Mol. Mass.:70029.57
Organism:Homo sapiens (Human)
Description:P00734
Residue:622
BDBM50158158
NameBDBM50158158
Synonyms:CHEMBL3780208
TypeSmall organic molecule
Emp. Form.C31H37N5O2
Mol. Mass.511.6578
SMILESNC(=N)c1cccc(c1)N1CC(CN(CC2CCN(Cc3ccccc3)CC2)C1=O)OCc1ccccc1