Reaction Details
TargetSuppressor of tumorigenicity 14 protein
LigandBDBM50158150
Substrate/Competitorn/a
Meas. Tech.ChEMBL_1565752 (CHEMBL3782550)
Ki 520±n/a nM
Citation Venukadasula, PKOwusu, BYBansal, NRoss, LJHobrath, JVBao, DTruss, JWStackhouse, MMessick, TEKlampfer, LGalemmo, RA Design and Synthesis of Nonpeptide Inhibitors of Hepatocyte Growth Factor Activation. ACS Med Chem Lett7:177-81 (2016) 
 
Suppressor of tumorigenicity 14 protein
Name:Suppressor of tumorigenicity 14 protein
Type:Single-pass type II membrane protein
Mol. Mass.:94769.23
Organism:Homo sapiens (Human)
Description:Q9Y5Y6
Residue:855
BDBM50158150
NameBDBM50158150
Synonyms:CHEMBL3780005
TypeSmall organic molecule
Emp. Form.C30H36N6O3S
Mol. Mass.560.71
SMILESNC(=N)c1cccc(c1)N1CC(CN(CC2CCN(Cc3ccccc3)CC2)C1=O)NS(=O)(=O)c1ccccc1