Reaction Details
TargetProthrombin
LigandBDBM50158162
Substrate/Competitorn/a
Meas. Tech.ChEMBL_1565756 (CHEMBL3782596)
Ki>100000±n/a nM
Citation Venukadasula, PKOwusu, BYBansal, NRoss, LJHobrath, JVBao, DTruss, JWStackhouse, MMessick, TEKlampfer, LGalemmo, RA Design and Synthesis of Nonpeptide Inhibitors of Hepatocyte Growth Factor Activation. ACS Med Chem Lett7:177-81 (2016) 
 
Prothrombin
Name:Prothrombin
Type:Protein
Mol. Mass.:70029.57
Organism:Homo sapiens (Human)
Description:P00734
Residue:622
BDBM50158162
NameBDBM50158162
Synonyms:CHEMBL3780437
TypeSmall organic molecule
Emp. Form.C24H31N5O
Mol. Mass.405.5358
SMILESCC1CN(C2CCN(Cc3ccccc3)CC2)C(=O)N(C1)c1ccc(cc1)C(N)=N