Reaction Details
TargetProthrombin
LigandBDBM50158153
Substrate/Competitorn/a
Meas. Tech.ChEMBL_1565756 (CHEMBL3782596)
Ki 42300±n/a nM
Citation Venukadasula, PKOwusu, BYBansal, NRoss, LJHobrath, JVBao, DTruss, JWStackhouse, MMessick, TEKlampfer, LGalemmo, RA Design and Synthesis of Nonpeptide Inhibitors of Hepatocyte Growth Factor Activation. ACS Med Chem Lett7:177-81 (2016) 
 
Prothrombin
Name:Prothrombin
Type:Protein
Mol. Mass.:70029.57
Organism:Homo sapiens (Human)
Description:P00734
Residue:622
BDBM50158153
NameBDBM50158153
Synonyms:CHEMBL3780548
TypeSmall organic molecule
Emp. Form.C32H38N6O2
Mol. Mass.538.6831
SMILESNC(=N)c1cccc(c1)N1CC(CN(CC2CCN(Cc3ccccc3)CC2)C1=O)NC(=O)Cc1ccccc1