Reaction Details
TargetLysine-specific demethylase 5B
LigandBDBM50158703
Substrate/Competitorn/a
Meas. Tech.ChEMBL_1566311 (CHEMBL3788938)
IC50 100±n/a nM
Citation McAllister, TEEngland, KSHopkinson, RJBrennan, PEKawamura, ASchofield, CJ Recent Progress in Histone Demethylase Inhibitors. J Med Chem59:1308-29 (2016) 
 
Lysine-specific demethylase 5B
Name:Lysine-specific demethylase 5B
Type:Protein
Mol. Mass.:175659.67
Organism:Homo sapiens (Human)
Description:Q9UGL1
Residue:1544
BDBM50158703
NameBDBM50158703
Synonyms:CHEMBL3785832 US9604961, Example 53 US9908865, Example 53
TypeSmall organic molecule
Emp. Form.C16H12ClN3O3
Mol. Mass.329.738
SMILESOC(=O)c1ccnc(c1)-n1nccc1OCc1ccc(Cl)cc1