Reaction Details
TargetLysine-specific demethylase 4B
LigandBDBM50158848
Substrate/Competitorn/a
Meas. Tech.ChEMBL_1566040 (CHEMBL3791427)
IC50<1000±n/a nM
Citation McAllister, TEEngland, KSHopkinson, RJBrennan, PEKawamura, ASchofield, CJ Recent Progress in Histone Demethylase Inhibitors. J Med Chem59:1308-29 (2016) 
 
Lysine-specific demethylase 4B
Name:Lysine-specific demethylase 4B
Type:PROTEIN
Mol. Mass.:121904.33
Organism:Homo sapiens (Human)
Description:ChEMBL_109446
Residue:1096
BDBM50158848
NameBDBM50158848
Synonyms:CHEMBL3787516
TypeSmall organic molecule
Emp. Form.C24H29N3O2
Mol. Mass.391.506
SMILESCN(C)CCCCCCNC(=O)c1cccc(c1)-c1cc(O)c2ncccc2c1