Reaction Details
TargetLysine-specific demethylase 5A
LigandBDBM50158825
Substrate/Competitorn/a
Meas. Tech.ChEMBL_1566042 (CHEMBL3791429)
IC50<100±n/a nM
Citation McAllister, TEEngland, KSHopkinson, RJBrennan, PEKawamura, ASchofield, CJ Recent Progress in Histone Demethylase Inhibitors. J Med Chem59:1308-29 (2016) 
 
Lysine-specific demethylase 5A
Name:Lysine-specific demethylase 5A
Type:Protein
Mol. Mass.:192091.79
Organism:Homo sapiens (Human)
Description:P29375
Residue:1690
BDBM50158825
NameBDBM50158825
Synonyms:CHEMBL3785404
TypeSmall organic molecule
Emp. Form.C22H22N6O2
Mol. Mass.402.4491
SMILESOc1nc(Oc2cnn(c2)[C@@H]2CCCN(Cc3ccccc3)C2)nc2cnccc12