Reaction Details
TargetLysine-specific demethylase 4A
LigandBDBM50158850
Substrate/Competitorn/a
Meas. Tech.ChEMBL_1566056 (CHEMBL3791443)
IC50 2400±n/a nM
Citation McAllister, TEEngland, KSHopkinson, RJBrennan, PEKawamura, ASchofield, CJ Recent Progress in Histone Demethylase Inhibitors. J Med Chem59:1308-29 (2016) 
 
Lysine-specific demethylase 4A
Name:Lysine-specific demethylase 4A
Type:Enzyme
Mol. Mass.:120647.83
Organism:Homo sapiens (Human)
Description:O75164
Residue:1064
BDBM50158850
NameBDBM50158850
Synonyms:CHEMBL3785434
TypeSmall organic molecule
Emp. Form.C3H6N6O
Mol. Mass.142.1193
SMILESNNC(=O)Cc1nnn[nH]1