Reaction Details
TargetLysine-specific demethylase 6B
LigandBDBM50158850
Substrate/Competitorn/a
Meas. Tech.ChEMBL_1566058 (CHEMBL3791445)
IC50 98000±n/a nM
Citation McAllister, TEEngland, KSHopkinson, RJBrennan, PEKawamura, ASchofield, CJ Recent Progress in Histone Demethylase Inhibitors. J Med Chem59:1308-29 (2016) 
 
Lysine-specific demethylase 6B
Name:Lysine-specific demethylase 6B
Type:Protein
Mol. Mass.:176672.55
Organism:Homo sapiens (Human)
Description:O15054
Residue:1643
BDBM50158850
NameBDBM50158850
Synonyms:CHEMBL3785434
TypeSmall organic molecule
Emp. Form.C3H6N6O
Mol. Mass.142.1193
SMILESNNC(=O)Cc1nnn[nH]1