Reaction Details
TargetLysine-specific demethylase 5C
LigandBDBM191599
Substrate/Competitorn/a
Meas. Tech.ChEMBL_1566344 (CHEMBL3789448)
IC50<1000±n/a nM
Citation McAllister, TEEngland, KSHopkinson, RJBrennan, PEKawamura, ASchofield, CJ Recent Progress in Histone Demethylase Inhibitors. J Med Chem59:1308-29 (2016) 
 
Lysine-specific demethylase 5C
Name:Lysine-specific demethylase 5C
Type:PROTEIN
Mol. Mass.:175691.17
Organism:Homo sapiens (Human)
Description:P41229
Residue:1560
BDBM191599
NameBDBM191599
Synonyms:KDOAM-21 | ethyl 2-(((2-((2-(dimethylamino)ethyl)(ethyl)amino)-2-oxoethyl)amino)methyl)isonicotinate (KDM5-C70)
TypeSmall organic molecule
Emp. Form.C17H28N4O3
Mol. Mass.336.4292
SMILESCCOC(=O)c1ccnc(CNCC(=O)N(CC)CCN(C)C)c1