Reaction Details
TargetLysine-specific histone demethylase 1A
LigandBDBM50158870
Substrate/Competitorn/a
Meas. Tech.ChEMBL_1565790 (CHEMBL3789175)
IC50 5.0±n/a nM
Citation McAllister, TEEngland, KSHopkinson, RJBrennan, PEKawamura, ASchofield, CJ Recent Progress in Histone Demethylase Inhibitors. J Med Chem59:1308-29 (2016) 
 
Lysine-specific histone demethylase 1A
Name:Lysine-specific histone demethylase 1A
Type:Enzyme
Mol. Mass.:92901.01
Organism:Homo sapiens (Human)
Description:O60341
Residue:852
BDBM50158870
NameBDBM50158870
Synonyms:CHEMBL3787230
TypeSmall organic molecule
Emp. Form.C15H22N2
Mol. Mass.230.3486
SMILESC(N[C@@H]1C[C@H]1c1ccccc1)C1CCNCC1