Reaction Details
TargetLysine-specific demethylase 4E
LigandBDBM50396018
Substrate/Competitorn/a
Meas. Tech.ChEMBL_1566029 (CHEMBL3791187)
IC50 200±n/a nM
Citation McAllister, TEEngland, KSHopkinson, RJBrennan, PEKawamura, ASchofield, CJ Recent Progress in Histone Demethylase Inhibitors. J Med Chem59:1308-29 (2016) 
 
Lysine-specific demethylase 4E
Name:Lysine-specific demethylase 4E
Type:Enzyme
Mol. Mass.:56815.71
Organism:Homo sapiens (Human)
Description:B2RXH2
Residue:506
BDBM50396018
NameBDBM50396018
Synonyms:CHEMBL1230640
TypeSmall organic molecule
Emp. Form.C10H7NO3
Mol. Mass.189.1675
SMILESOC(=O)c1ccc(O)c2ncccc12