Reaction Details
TargetNeurotensin receptor type 1
LigandBDBM50159205
Substrate/Competitorn/a
Meas. Tech.ChEMBL_1568948 (CHEMBL3789067)
Ki 0.360000±n/a nM
Citation Keller, MKuhn, KKEinsiedel, JHübner, HBiselli, SMollereau, CWifling, DSvobodová, JBernhardt, GCabrele, CVanderheyden, PMGmeiner, PBuschauer, A Mimicking of Arginine by Functionalized N(¿)-Carbamoylated Arginine As a New Broadly Applicable Approach to Labeled Bioactive Peptides: High Affinity Angiotensin, Neuropeptide Y, Neuropeptide FF, and Neurotensin Receptor Ligands As Examples. J Med Chem59:1925-45 (2016) 
 
Neurotensin receptor type 1
Name:Neurotensin receptor type 1
Type:PROTEIN
Mol. Mass.:46278.89
Organism:Homo sapiens (Human)
Description:ChEMBL_1453811
Residue:418
BDBM50159205
NameBDBM50159205
Synonyms:CHEMBL3785233
TypeSmall organic molecule
Emp. Form.C53H82F12N14O19
Mol. Mass.1447.2814
SMILESOC(=O)C(F)(F)F.OC(=O)C(F)(F)F.OC(=O)C(F)(F)F.OC(=O)C(F)(F)F.CC[C@H](C)[C@H](NC(=O)[C@H](Cc1ccc(O)cc1)NC(=O)[C@@H]1CCCN1C(=O)[C@H](CCCN\C(N)=N/C(=O)NCCOCCOCCN)NC(=O)[C@@H](N)CCCNC(N)=N)C(=O)N[C@@H](CC(C)C)C(O)=O