Reaction Details
TargetNeuropeptide FF receptor 2
LigandBDBM50159225
Substrate/Competitorn/a
Meas. Tech.ChEMBL_1569167 (CHEMBL3791113)
Ki 27±n/a nM
Citation Keller, MKuhn, KKEinsiedel, JHübner, HBiselli, SMollereau, CWifling, DSvobodová, JBernhardt, GCabrele, CVanderheyden, PMGmeiner, PBuschauer, A Mimicking of Arginine by Functionalized N(¿)-Carbamoylated Arginine As a New Broadly Applicable Approach to Labeled Bioactive Peptides: High Affinity Angiotensin, Neuropeptide Y, Neuropeptide FF, and Neurotensin Receptor Ligands As Examples. J Med Chem59:1925-45 (2016) 
 
Neuropeptide FF receptor 2
Name:Neuropeptide FF receptor 2
Type:Enzyme Catalytic Domain
Mol. Mass.:60293.78
Organism:Homo sapiens (Human)
Description:NPFF2 0 HUMAN::Q9Y5X5
Residue:522
BDBM50159225
NameBDBM50159225
Synonyms:CHEMBL3786583
TypeSmall organic molecule
Emp. Form.C76H104F9N19O23
Mol. Mass.1822.7381
SMILESOC(=O)C(F)(F)F.OC(=O)C(F)(F)F.OC(=O)C(F)(F)F.CC(C)C[C@H](NC(=O)[C@H](CO)NC(=O)[C@H](Cc1c[nH]c2ccccc12)NC(=O)[C@H](Cc1ccc(O)cc1)NC(=O)[C@@H](N)CCC(O)=O)C(=O)N[C@@H](C)C(=O)N[C@@H](C)C(=O)N1CCC[C@H]1C(=O)N[C@@H](CCC(N)=O)C(=O)N[C@@H](CCCN\C(N)=N/C(=O)NCCCCN)C(=O)N[C@@H](Cc1ccccc1)C(N)=O