Reaction Details
TargetTransient receptor potential cation channel subfamily M member 8
LigandBDBM50318482
Substrate/Competitorn/a
Meas. Tech.ChEMBL_1569201 (CHEMBL3791384)
EC50 75000±n/a nM
Citation Bertamino, AOstacolo, CAmbrosino, PMusella, SDi Sarno, VCiaglia, TSoldovieri, MVIraci, NFernandez Carvajal, Ade la Torre-Martinez, RFerrer-Montiel, AGonzalez Muniz, RNovellino, ETaglialatela, MCampiglia, PGomez-Monterrey, I Tryptamine-Based Derivatives as Transient Receptor Potential Melastatin Type 8 (TRPM8) Channel Modulators. J Med Chem59:2179-91 (2016) 
 
Transient receptor potential cation channel subfamily M member 8
Name:Transient receptor potential cation channel subfamily M member 8
Type:Enzyme
Mol. Mass.:127633.53
Organism:Rattus norvegicus (Rat)
Description:Q8R455
Residue:1104
BDBM50318482
NameBDBM50318482
Synonyms:(-)-menthol MENTHOL l-menthol
TypeSmall organic molecule
Emp. Form.C10H20O
Mol. Mass.156.2652
SMILESCC(C)[C@@H]1CC[C@@H](C)C[C@H]1O