Reaction Details
TargetReceptor-interacting serine/threonine-protein kinase 1
LigandBDBM36372
Substrate/Competitorn/a
Meas. Tech.ChEBML_1569452
IC50 630±n/a nM
Citation Harris, PAKing, BWBandyopadhyay, DBerger, SBCampobasso, NCapriotti, CACox, JADare, LDong, XFinger, JNGrady, LCHoffman, SJJeong, JUKang, JKasparcova, VLakdawala, ASLehr, RMcNulty, DENagilla, ROuellette, MTPao, CSRendina, ARSchaeffer, MCSummerfield, JDSwift, BATotoritis, RDWard, PZhang, AZhang, DMarquis, RWBertin, JGough, PJ DNA-Encoded Library Screening Identifies Benzo[b][1,4]oxazepin-4-ones as Highly Potent and Monoselective Receptor Interacting Protein 1 Kinase Inhibitors. J Med Chem59:2163-78 (2016) 
 
Receptor-interacting serine/threonine-protein kinase 1
Name:Receptor-interacting serine/threonine-protein kinase 1
Type:Enzyme Catalytic Domain
Mol. Mass.:75926.99
Organism:Homo sapiens (Human)
Description:Q13546
Residue:671
BDBM36372
NameBDBM36372
Synonyms:(5R)-5-[(7-chloro-1H-indol-3-yl)methyl]-3-methyl-2,4-Imidazolidinedione, 11 | CID11288934
TypeSmall oganic molecule
Emp. Form.C13H12ClN3O2
Mol. Mass.277.706
SMILESCN1C(=O)N[C@H](Cc2c[nH]c3c(Cl)cccc23)C1=O